Yarn Build Error Command Failed With Exit Code 1






"; exit -1; fi 3b) If you downloaded and extracted a firmware in. Build errors may come from gmake or more commonly from one of the build tools: compiler, linker or XDCtools. 4" is an optional dependency and failed compatibility check. 1 Solution Waterfall vs Agile Build Approach 0 Solution. The new parser code is expected to be more robust and should catch all of the edge cases that were not handled by the previous one. The container-executor does not recognize the command it was asked to run. My first project worked fine, but when I tried to run a new project, the build failed (not from syntax errors or anything) and gave me this notification:. yarn test Alternative. Visual Studio Code is a code editor redefined and optimized for building and debugging modern web and cloud applications. py -> build/lib. No: timeout: Stop the command if it doesn't finish within the specified time (given in milliseconds). TechNet suggests this one-liner to convert the exit code into a more traditional exit code: (robocopy c:\dirA c:\dirB *. Linux JF (Japanese FAQ) Project. 1 $ node build/npm/preinstall. Exit code: 1 Unable to parse command line. Could you try building it on Rawhide with LLVM/Clang 3. info “[email protected] First issue I ran into was implimenting pre-written scss, and reformatting it to abide to Stylelinter. So I have a code clang: error: linker command failed with exit code 1 ionic to never turn off and the failed slots. error: command 'C:\\Program Files (x86)\\Microsoft Visual Studio\\2017\\Community\\VC\\Tools\\MSVC\\14. By default, cordova create script generates a skeletal web-based application whose start page is the project's www/index. Spring Cloud Data Flow is a cloud-native orchestration service for composable data microservices on modern runtimes. I tried to build UE4 source but always got errors. / And why rail I on this commodity? 2) Henry 8 3. py -> build/lib. So your only options are to either restore from backup (assuming you were at least making backups) or to build a new instance. info " [email protected] Overview An Urchin Log Source can be configured to collect a webserver log from a remote server via FTP or HTTP. Things got a bit more strict, when you are not running command windows as administrator some executables are no longer found. 2011-06-01 Adam Roben Delete a bunch of dead code in DrawingAreaImpl LayerTreeHost::participatesInDisplay always returns false now, which means a bunch of code in DrawingAreaImpl no longer runs. Error: cmd: Command failed with exit code 1 Error output: FAILURE: Build failed with an exception. I’ve googled it, but the solutions were only for Xcode users. Design studies for project are collected in 150-page report, containing wealth of information on design of lightning protection systems and on instrumentation for monitoring current waveforms of lightning strokes. Hi Circle Ci teams ! We have an embarrassing error launching our tests with Circle CI 2. 2751,"normal","[email protected] 11:6d1b6a68f775, Dec 5 2015, 20:40:30) [MSC v. clang: error: linker command failed with exit code 1 (use -v to see invocation) this problem even though there is no problem on the code. I recently started to try and eject my app that is currently in a yarn workspace. yarn安装node-sass报错问题. React native iOS build clang: error: linker command failed with exit code 1 (use -v to see invocation) clang: error: linker command failed with exit code 1 (use. linux-i686-2. error: linking with `cc` failed: exit code: 1 | = note: "cc" […] = note: ld: dynamic main executables must link with libSystem. Could you try building it on Rawhide with LLVM/Clang 3. Build the App. If you would like to customize the exit code in some scenarios, specially when no tests are collected, consider using the pytest-custom_exit_code plugin. But seems like nothing changed. 3 problem when trying to run my gateway and the probleme got fixed with yarn autoclean then yarn init you set it then yarn start went well without. You are defining TableLookup in your header file, which you include from multiple source (and because of that, object) files. I'm assuming the exit code is from the Unix operating system not PERL. When working with Python 3. I’ve combed through the build logs of both the successful and failed builds and the only differences I can spot are that the netlify/build version has gone up from 1. Пишет это ERROR: Command errored out with exit status 1: python setup. Execution: $. 7 before, and it linked to this version's LIB, therefore, it cann't find the VLPGrabber. With the -s option, this command changes the exit code based on the outcome of the build (exit code 0 indicates a success. Code Yarns 👨‍💻 I come with the same error, but I’m not the administrator. 6/MySQLdb copying MySQLdb/__init__. Bugzilla – Bug 2670-> task in 'ns3module_lte' failed (exit status 4): Last modified: 2017-03-16 01:04:06 EDT. 1, ASDF allows to do that. c -o build/temp. React native iOS build clang: error: linker command failed with exit code 1 (use -v to see invocation) clang: error: linker command failed with exit code 1 (use. 1; bad reference assignment +* (bug 8688) Handle underscores/spaces in Special:Blockip and Special:Ipblocklist + in a consistent manner +* (bug 8701) Check database lock status when blocking/unblocking users +* ParserOptions and ParserOutput classes are now in their own files +* (bug 8708. The second and third arguments–plus any further arguments if they were there–are then recombined by slicing ${@:2}. 2011-06-01 Adam Roben Delete a bunch of dead code in DrawingAreaImpl LayerTreeHost::participatesInDisplay always returns false now, which means a bunch of code in DrawingAreaImpl no longer runs. Let’s fix “Make Failed with Exit Code 2” Error. info [email protected] exe" in the correct PATH/Folder. noarch) scriptlet failed, exit status 1. js 运行时报错"Command failed with exit code 1. Exit code: 1 Command: C:\WINDOWS\system32\cmd. Using exit codes in your bash scripts. 586: Bastard: "From a resolv'd and honorable war / To a most base and vile-concluded peace. it seems that there is a network issue, pls check your network and try many times in different time. Unfortunately no snapshot - I've never had an issue with the updates before, so didn't even think to do so. Two sources might be considered. If I run the same command form the desktop or command line it works. py -> build/lib. By default, cordova create script generates a skeletal web-based application whose start page is the project's www/index. don't care if it failed or succeeded): (robocopy c:\dirA c:\dirB *. android sdk build tool이니 뭐니 하는 것들도 업데이트 하라고 해서 다 했습니다. Still the same problem. sh touch: cannot touch '/root/test': Permission denied $ echo $? 1 As you can see, since the last command run was touch the exit code reflects the true status of the script; failed. 17" is an optional dependency and failed compatibility check. That build uses g++ so it definitely looks like a problem specific to clang. re-build gnome-mag. The XKB layout code for this layout if you know it. You may need to add path to the command to PATH environment variable. dylib for architecture x86_64 clang: error: linker command failed with exit code 1 […]. Symptoms Using -executeMethod and BuildPipeline. Exit Code 1 Errors. Hello, When I try to build or run my project on android. I'm trying to install 3rd party python apps using pip command and getting the following error: gcc -pthread -fno-strict-aliasing -fwrapv -Wall -Wstrict-prototypes -fPIC -std=c99 -O3 -fomit-frame-pointer -Isrc/ -I/usr/include/python2. Java and the Windows Command Prompt This page is obsolete. 26: Time: 6262ms [13] multi customizer 40 bytes {1} [built] [14] multi main 52 bytes {0} [built] + 13 hidden modules: ERROR in. SETUID_OPER_FAILED. css(""height"",""120""); this failed generally (although it worked when executing the command in the browser console) " harmr 15 36933 TinyMCE failing when using ModPagespeed Administration 4. arm-none-eabi-gcc. 2751,"normal","[email protected] TechNet suggests this one-liner to convert the exit code into a more traditional exit code: (robocopy c:\dirA c:\dirB *. Failed to initialize vn hax exiting error code 126. 6: No: resultproperty: the name of a property in which the return code of the command should be stored. 10060 A connection attempt failed because the connected party did not properly respond after a period of time, or established connection failed because connected host has failed to respond. The unity short and long log of unity build cloud doesn't give any specific detail: 2266: [xcode] clang: error: linker command failed with exit code 1 (use -v to see invocation). 4 Here the build log. 1 for an Objective-C project t that requires the Swift3 3rd party library. If you select Control Options: Continue on error, then the exit 1 will result in a partially successful build instead of a failed build. json files accordingly. It lets you build simple menus just from this one command. React Native 开发的项目,Android 方面没有任何问题,IOS 就是无法跑起来,报错信息如下: mac 10. When a script ends with an exit that has no parameter, the exit status of the script is the exit status of the last command executed in the script (previous to the exit). How could I do? Like Like. I tried to build UE4 source but always got errors. I went through the installation instructions for react-native-unimodules. The typical build settings are as follows: Build command: npm run docs:build or yarn docs:build; Publish directory: docs/. [2019-01-10 17:22:05. The Design of Lightning Protection. info " [email protected] 1 │ ├─ [email protected]^1. query-string module Build 오류 yarn build yarn run v1. By default, cordova create script generates a skeletal web-based application whose start page is the project's www/index. jars (none) List of libraries containing Spark code to distribute to YARN containers. 2 Node is 8. Run Unity in batch mode. py install for mysqlclient. yarn buildで’fileLoader’ of undefinedエラー. sh: line 3: non-existing-command: command not found 127 Value 127 is returned by your shell /bin/bash when any given command within your bash script or on bash command line is not found in any of the paths defined by PATH system environment variable. error Command failed with exit code 1. 1로 업그레이드 하고. clang: error: linker command failed with exit code 1 (use -v to see invocation) this problem even though there is no problem on the code. Creative Cloud applications store information about the installation and launch process in log files. You are defining TableLookup in your header file, which you include from multiple source (and because of that, object) files. - NO RESULT 4. Windows Setup failed with hexadecimal exit code 0x80070241 (decimal 2147942977). scss: Module build failed: Error. From sg3_utils version 1. Any initialization should be specified as part of the deviceready event handler defined in www/js/index. 04) The tests works fine on my MacOSX and on our Ubuntu 16. Using exit codes in your bash scripts. info "[email protected] 11:6d1b6a68f775, Dec 5 2015, 20:40:30) [MSC v. [email protected], I don't know which steps you followed. Exit Code 1 Errors. Windows Exit Code = 3 while running command task: Version: \GolfRez\w4\accinq\ 01 2 error=3. 4: The platform "openbsd" is incompatible with this module. Audiokinetic Wwise Help - Cannot schedule music switch transition in upcoming segments: using Exit Cue. 11:6d1b6a68f775, Dec 5 2015, 20:40:30) [MSC v. Linux JF (Japanese FAQ) Project. This is commonly due to some RubyGem overwriting the at_exit handler of another RubyGem, in this case RSpec’s. 167] [INFO] vide - [vizClient] clang: error: linker command failed with exit code 1 (use -v to see invocation) Expand Post Translate with Google Show Original Show Original Choose a language. Just see for yourself below. 11 does not build on Mac OS X 10. ; Rajeev, K. exe checkin exited with code 100. How an I fix this error? P. Root cause Docker is not enabled. exe: error: CreateProcess: No such file or directory The command 'arm-none-eabi-gcc. Core is used in a DotNetCliToolReference (comes standard), nothing. By default this will run CMake on the Source/Bin directories specified unless –build-nocmake is specified. 2 but doesn't change. PowerShell commands returning exit code 1 despite working natively. The failed command reports all distributions that failed on one of make, test or install for some reason in the currently running shell session. Root cause Docker is not enabled. Getting linker command failed with exit code 1 on the build server. react前端项目在用yarn install命令安装依赖时报错了,看了下报错信息是node-sass安装的时候编译报错. Build errors may come from gmake or more commonly from one of the build tools: compiler, linker or XDCtools. This will point yarn to whatever version of node you decide to use. If command starts with a quote, the first and last quote chars in command will be removed, whether /s is specified or not. Please experiment with setxkbmap or -xkblayout (as described in Q: 5. If the process was terminated by some means other than an exit status, the domain will be G_SPAWN_ERROR, and the code will be G_SPAWN_ERROR_FAILED. sh: line 3: non-existing-command: command not found 127 Value 127 is returned by your shell /bin/bash when any given command within your bash script or on bash command line is not found in any of the paths defined by PATH system environment variable. For example, the Hadoop MapReduce framework can include pieces of information like number of map tasks, reduce tasks, counters…etc. 0" for ios Failed to install 'cordova-plugin-cccometchat': Error: pod: Command failed with exit code 1 at ChildProcess. Just see for yourself below. build 不成功,中間都有log 檔案,要看 log 檔裡寫什麼。 在 iOS 平台,如果有修改過 ionic 的 package name, 如果同步上有錯誤,請記得修改這3個檔案: config. error: command 'C:\\Program Files (x86)\\Microsoft Visual Studio\\2017\\Community\\VC\\Tools\\MSVC\\14. 5) to ensure your data and infrastructure are protected. Audiokinetic Wwise Help - Cannot schedule music switch transition in upcoming segments: using Exit Cue. exe' failed with exit code '1'. [1/4] Resolving packages… [2/4] Fetching packages… info [email protected] Edited by JS2010 Monday, July 24, 2017 5:41 PM Marked as answer by DeveloperCCC Tuesday, July 25, 2017 8:04 AM. src/_portaudiomodule. Spark; SPARK-7700; Spark 1. One of our developers had created a Utilities project which would be installed via our local NuGet store, and had added the Post-build event to create the NuGet package. 解决方法: 第一步:配置淘宝镜像 yarn config set regis. Always use this in conjunction with the other command line arguments to ensure no pop-up windows appear and eliminate the need for any human intervention. Failed to run MSBuild command: but I checked there is "msbuild. txt file with mkdocs>=0. Hey, you missed a command in there. Error: Command failed: gradlew. I recently installed Visual Studio Tools for Apache Cordova CTP 3. 1 in Visual Studio 2013 with Update 4 and when trying to build I kept getting the error: Command failed with exit code 8 Visual Studio - mdavscli. Left by JS on Jun 28, 2006 10:47 PM # Visual Studio Pre/Post-Build Events. error: linking with `cc` failed: exit code: 1 | = note: "cc" […] = note: ld: dynamic main executables must link with libSystem. A common exit code is exit code 65 or bad data input. android sdk build tool이니 뭐니 하는 것들도 업데이트 하라고 해서 다 했습니다. Getting linker command failed with exit code 1 on the build server. Cause When a buil. gz Installing collected packages: mysqlclient Running setup. The exit code = 1 immediately after the mkdir, which makes sense as /usr already exists, but when we again test the exit code in the conditional, it's not a nonzero value! Why? Because at that point, it indicates the exit code of the echo statement, not the mkdir command. Knowing this, we can examine why xcodebuild seems to love exiting with code 65. AT&T, the major U. py egg_info: Traceback (most recent call last): File " ", line 1, in File " C:\Users\wang\AppData\Local\Temp\pip-build-3s2h_rej\beautifulsoup\se tup. 6 copying _mysql_exceptions. We had a very annoying issue in the office recently regarding building a NuGet package with a Post-build event command line. 1 and unpack the archive file 2) Change to the directory where you unpacked Spark and type sbt/sbt assembly to build it 3) Make sure right version of maven (3. I've tried reinstalling BundlerMinifier. 2751,"normal","[email protected] Program exit codes allow determining the specific reason for command's or application's termination. It’s just. py -> build/lib. 1にしたらインストールできま The Free Software Media System. Hey, you missed a command in there. [email protected], I don't know which steps you followed. This ERROR is caused when you have an Environment Variable called GIT_EXEC_PATH. ## Introduction This page describes how to troubleshoot and resolve some of the common project import and build errors in CCS. jars (none) List of libraries containing Spark code to distribute to YARN containers. 4 Here the build log. 21" is incompatible with requested version "@types/[email protected] That build uses g++ so it definitely looks like a problem specific to clang. exe checkin exited with code 100. I'm not sure why yarn build command is the problem, but it works fine on my local terminal and that's the command I use normally. org","Samba server ignores FILE_OPEN_FOR_BACKUP_INTENT" 2064,"major. Hi Prajwal, not sure if you can help but I’m encountering this problem despite having a network account specified. am, src/Makefile. since Ant 1. else should configured run on yarn. Getting help on version, option names, environment variables ¶. Can you rename or relocate these directories so there are no spaces or dashes in the p. gz Installing collected packages: mysqlclient Running setup. Visual Studio Code is free and available on your favorite platform - Linux, macOS, and Windows. In your project root directory run this rm -rf node_modules && yarn cache clean && yarn and then try to yarn start again - Muhammad Haseeb May 6 at 6:02 add a comment | 3 Answers 3. 【已解决】使用 yarn 安装时,报错node_modules ode sass:Command failed. 1 Utility failed, for. android sdk build tool이니 뭐니 하는 것들도 업데이트 하라고 해서 다 했습니다. build error: linker command failed with exit code 1. No: failonerror: Stop the build process if the command exits with a return code signaling. Workflow: A collection of actions arranged in a control dependency DAG (Direct Acyclic Graph). To turn on Git debug logging, before pushing using the command line, proceed like this for different OS:. /V:ON Enable delayed environment variable expansion this allows a FOR loop to specify !variable! instead of %variable% expanding the variable at execution time instead of at input time. Build; Expected: Build to succeed Actual: The command "dotnet bundle clean" exited with code 1. Try with a custom build subroutine inside your script. error Command failed with exit code 1. CLI; Library; Configuration; Rule Flags; Type Checking; Third-Party Tools. These instructions are specialized to Windows 7, but are similar for Windows XP and Windows Vista. Thank you for great attention regard this article , I manage to sort this issue Due to some Path setup compatibility such users/,system/ 1-*nodejs - *12. See Arguments to Specify the. queue: default: The name of the YARN queue to which the application is submitted. * Bug #464705 - Provide option to keep caret in center of. Core, I've made usre BundlerMinifier. ""); I tried to add the following code to check if resize is possible: jQuery(""#TB_window""). The failed command reports all distributions that failed on one of make, test or install for some reason in the currently running shell session. The CLI process may exit with the following codes: 0: Linting succeeded without errors (warnings may have occurred) 1: An invalid command line argument or combination thereof was used; 2: Linting failed with one or more rule violations with severity error; Usage. NuGet pack fails with exited with code 1. The Design of Lightning Protection. ввожу эту команду pip3 install. System error: [3] 1259: This error code only occurs when using Windows Installer version 2. utils:yarn install yarn install v1. ac , Makefile. Excluding it from installation. If –test-command is specified then that will be run after the build is complete. Unityで書き出して、Xcodeでビルドするときに「linker command failed with exit code」がでた、という悩みを解決します。 結論としてUnityで書き出しするときに「Build」ではなく「Build And Run」を押すことで解決できます。. Error: Command failed: gradlew. info " [email protected] Workflow: A collection of actions arranged in a control dependency DAG (Direct Acyclic Graph). 1 in Visual Studio 2013 with Update 4 and when trying to build I kept getting the error: Command failed with exit code 8 Visual Studio - mdavscli. gz Complete output from command python setup. Program exit codes allow determining the specific reason for command's or application's termination. build 不成功,中間都有log 檔案,要看 log 檔裡寫什麼。 在 iOS 平台,如果有修改過 ionic 的 package name, 如果同步上有錯誤,請記得修改這3個檔案: config. build error: linker command failed with exit code 1. js [1/4] Resolving packages. 2 YARN_VERSION 1. don't care if it failed or succeeded): (robocopy c:\dirA c:\dirB *. @MatthewHut - Just a stab in the dark here, but I see that you have some spaces in your resource directories, plus a - (dash). 1) King John 2. Yarn should just spawn a shell and run the command. 6 creating build/lib. query-string module Build 오류 yarn build yarn run v1. 3 (build server) 9816: [xcode] ld: framework not found EveryplayCore 9817: [xcode] clang: error: linker command failed with exit code 1 (use -v to see invocation). First issue I ran into was implimenting pre-written scss, and reformatting it to abide to Stylelinter. Build the App. 1, ASDF allows to do that. Example: Log a warning about a specific place in a file Bash. 2 normal normal defect (bug) new 2016-05-24T15:07:41Z 2019-06. 0 (Ubuntu 14. 4 Here the build log. o] Error 1 gyp ERR! build error gyp ERR! stack Error: `make` failed with exit code: 2 gyp ERR! stack at ChildP…. The first image in the example is ~198MB, while the second one is only 86. Root cause Docker is not enabled. vuepress/dist # MkDocs. [1/4] Resolving packages… [2/4] Fetching packages… info [email protected] 3” is an optional dependency and failed compatibility check. Hello, When I try to build or run my project on android. Run with --info or --debug option to get more log output. In your first PS-Example, you just execute a command, which gives a return code of 1. 6 copying _mysql_exceptions. The unity short and long log of unity build cloud doesn't give any specific detail: 2266: [xcode] clang: error: linker command failed with exit code 1 (use -v to see invocation). Solution to (ERROR: Failed to build gem native extension. Exit code: 1 Command: C:\WINDOWS\system32\cmd. To set an exit code in a script use exit 0 where 0 is the number you want to return. pip在下载turtle 0. Windows XP SP3 AMD signal, and no keyboard exit routers is a Netgear. bin mfastboot flash. I followed your guides (which are excellent by the way) to get the system up and running, I have a man site server for management and a distribution point on a different VLAN. nodemanager. As you can see the usage of Yarn Workspaces has proven to be quite burdensome to maintain. Always use this in conjunction with the other command line arguments to ensure no pop-up windows appear and eliminate the need for any human intervention. autoreconf failed with exit status 1. It has two language one is Objective-C and other one is Swift. 11 kB 0 [emitted] main [0]. Hello community, Since a week I can’t deploy new version of our app. c:31:20: fatal error: Python. When working with Python 3. No: failonerror: Stop the build process if the command exits with a return code signaling. That build uses g++ so it definitely looks like a problem specific to clang. @MatthewHut - Just a stab in the dark here, but I see that you have some spaces in your resource directories, plus a - (dash). Path Setup. Unfortunately no snapshot - I've never had an issue with the updates before, so didn't even think to do so. The arguments to this command line are the source and binary directories. / And why rail I on this commodity? 2) Henry 8 3. make: *** [Release/obj. Thank you for great attention regard this article , I manage to sort this issue Due to some Path setup compatibility such users/,system/ 1-*nodejs - *12. Actually, I managed to install bcrypt globally using yarn: yarn list|grep bcrypt warning Resolution field "@types/[email protected] ; Rajeev, K. Check your Code Signing setting Check your environment variables. This is commonly due to some RubyGem overwriting the at_exit handler of another RubyGem, in this case RSpec’s. 0 ├─ [email protected] My pod install command worked fine after updating the node_modul…. ----- Rebuild Failed: 07/21/2016 23:51:08 -----So now I will move to another computer. info “[email protected] Two sources might be considered. Exit code:1” and with 0 experience with any of this I have no idea how to fix this issue ^_^; Please take it slow with me because I am a complete novice and thank you in advance for any help you can provide. Excluding it from installation. 0 exit status means the command was successful without any errors. To identify the type of issue, lookup it against the table of known values of Windows Setup errors online. このエラーが出てyarn start, npm run 出来ない場合、それは新しいモジュールを追加した後にyarn. Execution: $. I am using Xcode 10. Can you rename or relocate these directories so there are no spaces or dashes in the p. 删除项目依赖包以及 y. The workaround is to install this at_exit handler in your code, as pointed out in this article. 4" is an optional dependency and failed compatibility check. 1500 64 bit (AMD64. Now that we’ve seen the basics, we need a portable method. “咚咚”,一阵急促的敲门声, 我从睡梦中惊醒,我靠,这才几点,谁这么早, 开门一看,原来我的小表弟放暑假了,来南京玩,顺便说跟我后面学习一个网站是怎么做出来的。. libcurl failed to get a sensible result back from the server as a response to either a PASV or a EPSV command. Just open the console, re. sln with Visual Studio 2017 (Development editor, W64), right click on the UE4 target and select Build and got this errors:. INVALID_COMMAND_PROVIDED. 1にしたらインストールできま The Free Software Media System. exe' failed with exit code '1' Summary: 6 Replies, Latest post by hli on 31 Mar 2015 02:49 PM PDT. AT&T, the major U. Is this possible Thanks! Tag: Team Foundation Server - Build Automation The command tf. The XKB layout code for this layout if you know it. Would this issue running at at high display back without video output? clang will come back on is command cable as well. 41292: Acronis Backup 11. Не могу установить модуль. This allows you to differentiate between different exit codes. 586: Bastard: "From a resolv'd and honorable war / To a most base and vile-concluded peace. Only of interest if failonerror=false. Spring Cloud Data Flow is a cloud-native orchestration service for composable data microservices on modern runtimes. Apart from the app installation and update errors, you could encounter errors while uninstalling the apps. Zero values for css styles cause mine to break and the normal yarn build command couldn’t point out the errors, thanks again. BUILD FAILED in 4m 48s. Then yarn build is what you want. 6 creating build/temp. PSMDTAG:FAQ: How can my script control the PowerShell exit code? Answers: 1. autoreconf failed with exit status 1. In addition, the following errors are also found Command CompileStoryboard failed with a nonzero exit code Command CompileXIB failed with a nonzero exit code. The workaround is to install this at_exit handler in your code, as pointed out in this article. I haven't used more than one command so far, but it is great to know that multiple commands can be used with a full build report. When Visual Studio compiles the following code: public keyword_sample class ClassA{ } my macros or add-in should suppress C# compiler error, emits special code associated with my keyword. service: Failed with result 'exit-code'. When an exception occurs during execution of the script code, the Asset server updates fail, or other operations fail, Unity immediately exits with return code 1. Excluding it from installation. Select the Start button, then in the search box on the taskbar, type command prompt. [[email protected] MySQL-python-1. Root cause Docker is not enabled. 1991-04-01. 6 creating build/lib. 6: No: resultproperty: the name of a property in which the return code of the command should be stored. 7's libstdc++, it might be better to push an update - the Mesa maintainers seem to be OK with this and they're the most important users of LLVM right now. 7 before, and it linked to this version's LIB, therefore, it cann't find the VLPGrabber. util does not exist. Overall, as your codebase progress and new updates occur, you might need to update and fix this Monorepo structure. If you would like to customize the exit code in some scenarios, specially when no tests are collected, consider using the pytest-custom_exit_code plugin. Apart from the app installation and update errors, you could encounter errors while uninstalling the apps. The failed command reports all distributions that failed on one of make, test or install for some reason in the currently running shell session. NASA Technical Reports Server (NTRS) 1983-01-01. eleazar: Linux - Newbie: 9: 07-21-2016 10:53 AM: collect2: error: ld returned 1 exit status , for make install gcc-4. exe’ failed with exit status 2, Programmer Sought, the best programmer technical posts sharing site. Zero values for css styles cause mine to break and the normal yarn build command couldn’t point out the errors, thanks again. -p, --proxy Enable http proxy to connect to the registry -x, --extra-args "" Extra arguments to pass through to NPM or Yarn -h, --help output usage information Extra Arguments. info “[email protected] internal: Container killed by YARN for exceeding memory limits. build_command Get the command line that will build this project. You can help protect yourself from scammers by verifying that the contact is a Microsoft Agent or Microsoft Employee and that the phone number is an official Microsoft global customer service number. CURLE_FTP_WEIRD_227_FORMAT (14). 1 in Visual Studio 2013 with Update 4 and when trying to build I kept getting the error: Command failed with exit code 8 Visual Studio - mdavscli. Solution to (ERROR: Failed to build gem native extension. 8, Snow Leopard, because: clang: error: linker command failed with exit code 1 (use -v to see invocation) Reported by: ballapete (Peter Dyballa). Excluding it from installation. I've combed through the build logs of both the successful and failed builds and the only differences I can spot are. Tried to reinstall windows SDK, checked "Game Development with C++" and "Unreal Engine Installer", run Setup. 2 YARN_VERSION 1. Now that we’ve seen the basics, we need a portable method. js [1/4] Resolving packages. Thanks for answering @villeristi, unfortinately it's not work but when yarn fetch the packages, it give me those warnings ( fsevents compatible only with Mac OS, May be the problem is there ) : warning [email protected] org","Samba server ignores FILE_OPEN_FOR_BACKUP_INTENT" 2064,"major. What visual studio command prompt? Well, ideally the vs which matches the one which was used to build python. Here, too, are meanings for each system error code, plus other ways they may appear. Exit Code 1 Errors. Example: Log a warning about a specific place in a file Bash. Flash each of the partitions in sequence using mfastboot, you need to enter the following commands one-by-one checking that each one returns an [OKAY] Code: mfastboot flash partition gpt. Incorrect arguments in command line. Previously, yarn run would just exit with code 1. Exit code:1” and with 0 experience with any of this I have no idea how to fix this issue ^_^; Please take it slow with me because I am a complete novice and thank you in advance for any help you can provide. 2 YARN_VERSION 1. 3) installed in your system. c:29:23: fatal error: portaudio. CURLE_FTP_WEIRD_227_FORMAT (14). Cleanup after fixing REGRESSION (WebKit2): Accelerated CSS animations have a lower framerate than in WebKit1 Reviewed by Anders Carlsson. As you can see the usage of Yarn Workspaces has proven to be quite burdensome to maintain. am and doc. re-build gnome-mag. Getting linker command failed with exit code 1 on the build server. It can also be referred as task or 'action node'. React native iOS build clang: error: linker command failed with exit code 1 (use -v to see invocation) clang: error: linker command failed with exit code 1 (use. *) ^& exit 0. Excluding it from installation. o] Error 1 gyp ERR! build error gyp ERR! stack Error: `make` failed with exit code: 2 gyp ERR! stack at ChildP…. Build the App. It might be that this is making aapt unhappy. The command “yarn build” fail each time without so much information. If you ever get a warning like this, stop and determine whether there is a reason for the remote server’s host key to change (such as if SSH was upgraded or the server itself was upgraded). 11:6d1b6a68f775, Dec 5 2015, 20:40:30) [MSC v. By default, Spark on YARN will use Spark jars installed locally, but the Spark jars can also be in a world-readable location on HDFS. If we remove the echo command from the script we should see the exit code of the touch command. BUILD FAILED in 4m 48s. 17: The platform "win32" is incompatible with this module. Could you try building it on Rawhide with LLVM/Clang 3. linux-x86_64-3. 1) King John 2. Thanks for answering @villeristi, unfortinately it's not work but when yarn fetch the packages, it give me those warnings ( fsevents compatible only with Mac OS, May be the problem is there ) : warning [email protected] exe' failed with exit code '1'. 2 YARN_VERSION 1. C:\Users\wang> pip3 install beautifulsoup Collecting beautifulsoup Using cached BeautifulSoup-3. Is this possible Thanks! Tag: Team Foundation Server - Build Automation The command tf. am, lib/Makefile. None of the "-fix" commands were working for me so I just did it manually. 2751,"normal","[email protected] SETUID_OPER_FAILEDThe command '/bin/sh -c yarn run tsc hello. 1 either one. linux-x86_64-2. 1 │ ├─ [email protected]^1. The typical build settings are as follows: Build command: mkdocs build; Publish directory. /scripts/build. vuepress/dist # MkDocs. 删除项目依赖包以及 y. With the -s option, this command changes the exit code based on the outcome of the build (exit code 0 indicates a success. Hello, When I try to build or run my project on android. The Design of Lightning Protection. The special semantics are that the actual exit code will be the code set in error, and the domain will be G_SPAWN_EXIT_ERROR. Exit Code 1 Errors. js is still using yarn dev. This document describes errors you may find in these logs, and provides solutions, where possible. exe' failed with exit code '1'. When I tried to build the project in Big Sur BETA6, I ran into a problem with the title. Exit code:1” and with 0 experience with any of this I have no idea how to fix this issue ^_^; Please take it slow with me because I am a complete novice and thank you in advance for any help you can provide. exe: error: linker command failed with exit code 1 (use -v to see invocation) ninja: build stopped: subcommand failed. 1 Utility failed, for. /V:ON Enable delayed environment variable expansion this allows a FOR loop to specify !variable! instead of %variable% expanding the variable at execution time instead of at input time. exe [2010-06-13 15:27:08] File version: 1. info Visit https://yarnpkg. 2 Node is 8. このエラーが出てyarn start, npm run 出来ない場合、それは新しいモジュールを追加した後にyarn. js Creating an. NASA Astrophysics Data System (ADS) Reddi, C. Namanya develop memang suka aneh, kadang tiba2 error, kadang tiba2 gagal build, padahal sebelumnya oke2 aja. js Directory: D:\Work\Projects\blockchain-first-template ode_modules ode-sass Output: Building: C:\Program Files odejs ode. Error: Command failed: gradlew. 26: Time: 6262ms [13] multi customizer 40 bytes {1} [built] [14] multi main 52 bytes {0} [built] + 13 hidden modules: ERROR in. In the first stage of the build, you copy the source code to the container and run the build command. Choose Command Prompt from the list of results. Hey, you missed a command in there. py -> build/lib. Can you make a small reproducible example that we can debug? rally25rs added the needs-repro-script label Dec 18, 2017. error: command ‘gcc’ failed with exit status 1 <<<<< build/lib. org","Samba server ignores FILE_OPEN_FOR_BACKUP_INTENT" 2064,"major. 【已解决】使用 yarn 安装时,报错node_modules ode sass:Command failed. You can help protect yourself from scammers by verifying that the contact is a Microsoft Agent or Microsoft Employee and that the phone number is an official Microsoft global customer service number. Knowing this, we can examine why xcodebuild seems to love exiting with code 65. Exit Code 1 Errors. org website and choose your machine and environment and it will provide you the command to run, like this -. - new: ability to reverify failed verifications - new: improved some engines - new: ability to choose fields to import data - fix: bug with importing WAC content - new: ability to delete multiple URLs from a project 4. With MAPREDUCE-3121, it is defined in ContainerExecutor as part of yarn-nodemanager which would be a problem for client-side code if it needs to understand the exit code. See Arguments to Specify the. service: Failed with result 'exit-code'. The height profiles of the zonal and meridional wind obtained from the meteor wind radar data recorded at Trivandrum (8 deg 36 min N, 77 deg E) are presented. CURLE_FTP_WEIRD_227_FORMAT (14). So your only options are to either restore from backup (assuming you were at least making backups) or to build a new instance. In the second build stage, you copy only the built artifacts (HTML, JS, ) to the container. But when I run the command in the command terminal [email protected]: [email protected]:~/vscode $. Getting linker command failed with exit code 1 on the build server. In some scenarios, when running rake rspec or even rspec directly, the command returns 0 even though the build failed. 2 Node is 8. Hello community, Since a week I can’t deploy new version of our app. System error: [3] 1259: This error code only occurs when using Windows Installer version 2. Winds in the meteor zone over Trivandrum. o] Error 1 gyp ERR! build error gyp ERR! stack Error: `make` failed with exit code: 2 gyp ERR! stack at ChildP…. It looks like you want to write out a. main : command provided 1 main : user is abc main : requested yarn user is abc Container exited with a non-zero exit code 1 Looks like the exit code from the linux container executor. Be careful when selecting the DISK number. 0 on YARN: Application failed 2 times due to AM Container. 2 Date Index · Thread Index · Other Months · All Mailing Lists Date Prev · Date Next · Thread Prev · Thread Next. error Command failed with exit code 127. py install for mysqlclient. Previously, yarn run would just exit with code 1. py ", line 22 print " Unit. The problem was that I has upgraded my version of Android SDK which was not compatible. Find answers to What does this mean (exited with code 9009) from the expert community at Experts Exchange. For instance, let’s say your python says Python 2. - NO RESULT 4. bat, GenerateProjectFiles. Why can't it find atlas ? Home › Forums › FLIR ONE SDK Development › iOS development › Installation and getting started › build error: linker command failed with exit code 1. Example: Log a warning about a specific place in a file Bash. Workflow: A collection of actions arranged in a control dependency DAG (Direct Acyclic Graph). 1? Given that C++ support is really broken with Clang 3. This will point yarn to whatever version of node you decide to use. A batch file return code is a code returned after the execution of a program. DONOTEDITTHISFILE!!!!! !!!!!$$$$$ !!!!!///// !!!"!&!&!+!+!S!T![!^!`!k!p!y! !!!"""'" !!!&& !!!'/'notfoundin"%s" !!!) !!!5" !!!9" !!!EOFinsymboltable !!!NOTICE. …that indicate the termination status of executed Command or Application. In the second example you call a script. “咚咚”,一阵急促的敲门声, 我从睡梦中惊醒,我靠,这才几点,谁这么早, 开门一看,原来我的小表弟放暑假了,来南京玩,顺便说跟我后面学习一个网站是怎么做出来的。. it seems that there is a network issue, pls check your network and try many times in different time. far understand, neccessary information run spark application in yarn mode provided in launch script. In addition, the following errors are also found Command CompileStoryboard failed with a nonzero exit code Command CompileXIB failed with a nonzero exit code. Exit code: 1 Unable to parse command line. Let’s assume that our above code is stored in a file called Test. I recently installed Visual Studio Tools for Apache Cordova CTP 3. ; Restore and repair system files. Windows PowerShell Exit Codes. build error: linker command failed with exit code 1. Either could not read the local groups database, or could not set UID or GID. c -o build/temp. - NO RESULT 4. This ERROR is caused when you have an Environment Variable called GIT_EXEC_PATH. We had a very annoying issue in the office recently regarding building a NuGet package with a Post-build event command line. css(""height"",""120""); this failed generally (although it worked when executing the command in the browser console) " harmr 15 36933 TinyMCE failing when using ModPagespeed Administration 4. It says yarn: command not found, Command failed with exit code 127: yarn build. internal: Container killed by YARN for exceeding memory limits. "control dependency" from one action to another means that the second action can't run until the first action has completed. exe: error: linker command failed with exit code 1 (use -v to see invocation) ninja: build stopped: subcommand failed. The workaround is to install this at_exit handler in your code, as pointed out in this article. With the -s option, this command changes the exit code based on the outcome of the build (exit code 0 indicates a success. bat, GenerateProjectFiles. I haven't used more than one command so far, but it is great to know that multiple commands can be used with a full build report. 2 normal normal defect (bug) new 2016-05-24T15:07:41Z 2019-06. sh install --arch=armhf yarn install v1. util does not exist. 7 to Python2. I even reinstalled the whole Python Setup an PyCharm IDE to see whether it is restricted by Windows 10 (Had this problem with DevCPP, Windows doesn't gave permission to build a file in C drive "exit code(1)"). The special semantics are that the actual exit code will be the code set in error, and the domain will be G_SPAWN_EXIT_ERROR. Unfortunately the build failed almost immediately. If –test-command is specified then that will be run after the build is complete. A normal termination will set the exitcode to 0. Since I don't know your setup, I can't say for sure, but I would venture a guess that you have hugo_0. The EXIT statement will stop the process and set the exitcode to whatever is specified. exe' failed with exit code '1' Summary: 6 Replies, Latest post by hli on 31 Mar 2015 02:49 PM PDT. 3 problem when trying to run my gateway and the probleme got fixed with yarn autoclean then yarn init you set it then yarn start went well without. txt file with mkdocs>=0. [3/4] Linking. - new: ability to reverify failed verifications - new: improved some engines - new: ability to choose fields to import data - fix: bug with importing WAC content - new: ability to delete multiple URLs from a project 4. I even reinstalled the whole Python Setup an PyCharm IDE to see whether it is restricted by Windows 10 (Had this problem with DevCPP, Windows doesn't gave permission to build a file in C drive "exit code(1)"). Windows PowerShell Exit Codes. json: No license field warning. 1500 64 bit (AMD64. The border size and color are customizable. My pod install command worked fine after updating the node_modul…. dylib for architecture x86_64 clang: error: linker command failed with exit code 1 […]. None of the "-fix" commands were working for me so I just did it manually. 2]# python setup. With the -s option, this command changes the exit code based on the outcome of the build (exit code 0 indicates a success. 25 the build infrastructure files (i. pip在下载turtle 0. If the YAML or the YAML::Syck module is installed a record of the internal state of all modules is written to disk after each step. My first attempt is always doing pip install package_i_want in some of my visual studio command prompts. * Try: Run with --stacktrace option to get the stack trace. INVALID_NM_ROOT. py -> build/lib. Only users with topic management privileges can see it. We've also separated the cursor color from the cross-hair color so you no longer have to find the one color that works best for both. js is still using yarn dev. Core is used in a DotNetCliToolReference (comes standard), nothing. Just open the console, re. 그런데 JNI 사용. For date formatting I tried downloading date-fns through: Installation failed and I got following warnings and errors: After that I left it there …. A description how the layout looks like. exe' failed with exit code '1' | 赛普拉斯半导体 the command 'arm-none-eabi-gcc. [1/4] Resolving packages… [2/4] Fetching packages… info [email protected] Inside the script, the throw gives a return code of 1, but the script itself has a return code of 0. Tried to reinstall windows SDK, checked "Game Development with C++" and "Unreal Engine Installer", run Setup. I'm receiving an exit code 64 in our batch scheduler (BMC product control-m) executing a PERL script on UX-HP. json: No license field warning. 6 copying _mysql_exceptions. I haven't come up against this yet, so haven't used the plugin. First, we need to install Portaudio modules. 0に上げる事で解決し.